{"text_format":"1","workbook":"xlsx","n_sheets":21,"sheets":["Cover","Checklist","Instructions","G1-G2 General Details","G3-G4-G5 Submission Data","G6 Business-Site Data","1 Water Use Summary","2 Management Review","3 Management Actions","4 End Use Definitions","5-1A Taps & Showers","5-1B Toilets & Urinals","Quarterly Lookup","5-2 Cooling Tower","6 End Use Inventory","7 End Use Totals","8 End Use Summary Chart","9-1 Water Saving Measures","9-2 Economic Assessment","9-3 Action Plan","Data"],"not_rendered":{"charts":2,"images":3,"macros":1,"external_links":0,"defined_names":38,"comments":13,"pivot_tables":0},"unopened":[{"sheet":"8 End Use Summary Chart","index":16,"reason":"not_a_worksheet"}],"bounds":{"document_bytes":16777216,"sheet_cells":100000,"rows_first":2000,"rows_last":500,"rows_between":2000,"halvings":0,"cell_chars":16384,"cell_head_chars":4096},"cells_cut":0,"cells_raw":0,"read":"whole","date_system":"1900"}

{"sheet":"Cover","index":0,"n_rows":28,"n_cols":3,"rows_kept":28,"cut":false,"hidden":false,"merged":[[19,2,19,7],[20,2,20,7],[27,1,32,7],[22,1,24,7],[18,2,18,7],[0,1,10,7],[17,2,17,7],[15,1,15,5],[16,2,16,7],[13,1,14,7]]}
[null,{"$f":"IF(C17=0,\"WEMP Template\",\"WEMP for \"&CHAR(10)&C17)","v":"WEMP Template"}]
[]
[]
[]
[]
[]
{"$rows_left_out":23}
{"sheet":"Checklist","index":1,"n_rows":20,"n_cols":6,"rows_kept":20,"cut":false,"hidden":false,"merged":[[19,2,19,3],[4,3,4,4],[16,3,16,4],[18,2,18,3],[5,3,5,4],[7,3,7,4],[9,3,9,4],[11,3,11,4],[15,3,15,4],[17,1,17,4],[13,3,13,4],[12,1,12,4],[14,1,14,4],[10,1,10,4],[1,1,1,4],[2,1,2,4],[3,1,3,4],[8,1,8,4],[6,1,6,4]]}
[]
[null,"WEMP Checklist"]
[null,"Make sure you complete this checklist prior to submitting the WEMP to the water service provider. Only complete the sections which are relevant to your WEMP as defined in the WEMP guideline. Non relevant cells have been blanked out."]
[null,"Compulsory"]
[null,null,"G1-G5","Have the general and submission details been completed?"]
[null,"General","Module"]
{"$rows_left_out":15}
{"sheet":"Instructions","index":2,"n_rows":29,"n_cols":4,"rows_kept":29,"cut":false,"hidden":false,"merged":[[3,1,3,3],[1,1,1,3],[8,1,8,3],[2,1,2,3]]}
[]
[null,"WEMP Template Instructions"]
[null,"NB: You do not need to print this sheet"]
[null,"General\n\nThis WEMP Template has been created by DERM to assist non-residential customers of water service providers outside South East Queensland to complete WEMPs. This template is 'Module' focused in that it is a ready made set of electronic forms for capturing information and data required for a WEMP by the WEMP Guideline. Modules 5-1A, 5-1B and 5-2 contain some basic calculations, the totals from which automatically transer to the End Use Inventory in module 6.                                                                                                                                                                   \n\nA WEMP Template User Guide has been written to assist non-residential customers in completing this WEMP Template. The user guide can be found on the WEMP page at <www.derm.qld.gov.au>. \n\nWater service providers and their non-residential customers are free to use their own calculating tools to substitute for modules 5-1A, 5-1B and 5-2, or indeed the Template as a whole. Whatever tools are used the Template represents the recommended minimum content and level of detail for a complying WEMP.  Water use and savings should be broken down by at least the following end use categories (further breakdowns may well be warranted):\n* Taps and showers\n* Toilets and urinals\n* Cooling towers\n* Outdoor\n* Process & Other\n\nCare should be taken to record the parameters, variables and assumptions made in determining water use and savings. \n\nCells in the Template modules are colour coded as follows:\n\n"]
[null,null,"White = data entry required"]
[null,null,"Yellow = drop down menu"]
{"$rows_left_out":24}
{"sheet":"G1-G2 General Details","index":3,"n_rows":13,"n_cols":8,"rows_kept":13,"cut":false,"hidden":false,"merged":[[7,1,7,2],[6,3,7,8],[12,3,12,4],[12,5,12,8],[9,4,9,5],[10,3,10,4],[10,5,10,8],[11,3,11,4],[11,5,11,8],[8,1,8,8],[5,6,5,7],[5,2,5,5],[1,1,1,8],[2,2,2,8],[4,2,4,5],[4,6,4,7],[3,2,3,5],[3,6,3,7]]}
[]
[null,"G1 Account Data"]
[null,"Business Name"]
[null,"Water Service Provider",null,null,null,null,"Account No."]
[null,"Name of Account Holder",null,null,null,null,"ABN or ACN"]
[null,"Address of Premises ",null,null,null,null,"Post Code"]
{"$rows_left_out":8}
{"sheet":"G3-G4-G5 Submission Data","index":4,"n_rows":18,"n_cols":5,"rows_kept":18,"cut":false,"hidden":false,"merged":[[9,3,10,3],[9,4,10,4],[17,1,17,4],[9,1,10,2],[11,1,11,2],[12,1,12,2],[1,1,1,4],[8,1,8,4],[2,1,2,2],[3,1,3,2],[4,1,4,2],[6,1,6,2],[5,1,5,2],[13,1,13,2],[14,1,14,2],[15,1,15,2],[16,1,16,4],[18,1,18,4]]}
[]
[null,"G3 Submission Details"]
[null,"WEMP Author",null,null,"Specify the name of the person undertaking this WEMP"]
[null,"Authorisation",null,null,"Specify the name of the person who authorises the WEMP on behalf of the business or non-residential property"]
[null,"Authority’s Signature",null,null,"Signature of person of appropriate authority in business or non-residential property to authorise WEMP"]
[null,"Position",null,null,"Business position title"]
{"$rows_left_out":13}
{"sheet":"G6 Business-Site Data","index":5,"n_rows":544,"n_cols":8,"rows_kept":544,"cut":false,"hidden":false,"merged":[[1,1,1,6],[7,2,7,6],[6,2,6,6],[2,2,2,6],[3,2,3,6],[4,2,4,6]]}
[]
[null,"G6 Business & Site Data"]
[null,"ANZSIC Industry Division Name"]
[null,"ANZSIC Industry Class","Supermarket and Grocery Stores"]
[null,"ANZSIC (2006) Code No.\n",{"$f":"IF(OR(ISBLANK(C3),ISBLANK(C4)),\"\",VLOOKUP(C4,ANZICC_List,2,FALSE))","v":""}]
[null,"Commercial Activity Description (outline the nature of the primary commercial or business activity conducted on the premises to further clarify the ANZSIC Code)",null,"Commercial Activity Unit (CAU)\n",null,"Alternative CAU"]
{"$rows_left_out":539}
{"sheet":"1 Water Use Summary","index":6,"n_rows":28,"n_cols":7,"rows_kept":28,"cut":false,"hidden":false,"merged":[[27,1,29,1],[21,1,24,1],[1,1,1,5],[2,2,2,5],[3,2,3,5],[4,2,4,5],[5,2,5,5],[6,2,6,5],[7,2,7,5],[8,2,8,5],[19,2,19,5],[18,2,18,5],[17,2,17,5]]}
[]
[null,"1. Water Use Summary ",null,null,null,null,"Comments"]
[null,"Baseline water use:","Value"]
[null,"Current water use period"]
[null,"Current water use consumption (ML/year)"]
[null,{"$f":"\"Commercial Activity Units (total number of \"&IF('G6 Business-Site Data'!G6= \"\",'G6 Business-Site Data'!E6, 'G6 Business-Site Data'!G6)&\"s in baseline period)\"","v":"Commercial Activity Units (total number of s in baseline period)"}]
{"$rows_left_out":23}
{"sheet":"2 Management Review","index":7,"n_rows":24,"n_cols":15,"rows_kept":24,"cut":false,"hidden":false,"merged":[[2,1,2,2],[0,0,23,0],[23,1,23,8],[0,8,22,8],[19,2,19,4],[15,2,15,4],[7,2,7,4],[3,2,3,4],[1,1,1,3]]}
[]
[null,"2. Water Management Review",null,null,"Business or Other Non-Residential Water Efficiency Rating:",{"$f":"REPT(\"«\",G2)","v":""},{"$f":"ROUND(AVERAGE(G5:G7,G9:G12,G14:G15,G17:G19,G21:G23),0)","v":0}]
[null,"Management element",null,"Description","Management achievement indicator","Actual \nrating","Length","Minimum preferred rating"]
[null,1,"General Management ",null,null,{"$f":"REPT(\"«\",G4)","v":""},{"$f":"ROUND(AVERAGE(G5:G7),0)","v":0},null,null,1,2,3,4,5,21]
[null,"a","Management commitment","How has your management planned to make operations water efficient?",null,{"$f":"IF(NOT(ISBLANK(E5)),REPT(\"«\",MATCH(E5,J5:N5,0)),\"\")","v":""},{"$f":"LEN(F5)","v":0},"«««",null,"We are still planning our formal written commitment","Our floor managers have a formal written commitment","Our group managers have a formal written commitment","Our area/sector managers have a formal written commitment","Our board has a formal written commitment",20]
[null,"b","Responsibilities identified and delegated","Has responsibility for water efficiency been assigned to a suitably qualified person or group?",null,{"$f":"IF(NOT(ISBLANK(E6)),REPT(\"«\",MATCH(E6,J6:N6,0)),\"\")","v":""},{"$f":"LEN(F6)","v":0},"«««",null,"We are still planning our water efficiency management delegation","Our floor managers are responsible for water efficiency","All levels from our group managers downward are responsible for water efficiency","All levels from our area/sector managers downward are responsible for water efficiency","All levels from our board downward are responsible for water efficiency",19]
{"$rows_left_out":19}
{"sheet":"3 Management Actions","index":8,"n_rows":24,"n_cols":20,"rows_kept":24,"cut":false,"hidden":false,"merged":[[12,9,12,12],[1,5,1,7],[1,1,1,4],[2,1,2,2],[3,9,3,12],[7,9,7,12]]}
[]
[null,"2. Water Management Review",null,null,null,"Business or Other Non-Residential Water Efficiency Rating:",null,null,{"$f":"ROUND(AVERAGE(I5:I7,I9:I12,I14:I15,I17:I19,I21:I23),0)","v":0}]
[null,"Management element",null,"Description","Preferred rating","Actual current rating","Target management \nachievement indicator","Target rating","Length","Action measure details","Person responsible (nominate officer)","Target completion date","Date completed"]
[null,1,"General Management ",null,null,null,null,{"$f":"REPT(\"«\",I4)","v":""},{"$f":"ROUND(AVERAGE(I5:I7),0)","v":0},null,null,null,null,null,1,2,3,4,5,21]
[null,"a","Management commitment","How has your management planned to make operations water efficient?",{"$f":"'2 Management Review'!H5","v":"«««"},{"$f":"'2 Management Review'!F5","v":""},null,{"$f":"IF(NOT(ISBLANK(G5)),REPT(\"«\",MATCH(G5,O5:S5,0)),\"\")","v":""},{"$f":"LEN(H5)","v":0},null,null,null,null,null,"We are still planning our formal written commitment","Our floor managers have a formal written commitment","Our group managers have a formal written commitment","Our area/sector managers have a formal written commitment","Our board has a formal written commitment",20]
[null,"b","Responsibilities identified and delegated","Has responsibility for water efficiency been assigned to a suitably qualified person or group?",{"$f":"'2 Management Review'!H6","v":"«««"},{"$f":"'2 Management Review'!F6","v":""},null,{"$f":"IF(NOT(ISBLANK(G6)),REPT(\"«\",MATCH(G6,O6:S6,0)),\"\")","v":""},{"$f":"LEN(H6)","v":0},null,null,null,null,null,"We are still planning our water efficiency management delegation","Our floor managers are responsible for water efficiency","All levels from our group managers downward are responsible for water efficiency","All levels from our area/sector managers downward are responsible for water efficiency","All levels from our board downward are responsible for water efficiency",19]
{"$rows_left_out":19}
{"sheet":"4 End Use Definitions","index":9,"n_rows":29,"n_cols":6,"rows_kept":29,"cut":false,"hidden":false,"merged":[[19,3,19,4],[27,3,27,4],[25,3,25,4],[28,3,28,4],[24,3,24,4],[21,3,21,4],[20,3,20,4],[16,3,16,4],[18,3,18,4],[26,3,26,4],[1,1,1,3],[2,1,3,5],[4,1,4,2],[4,4,4,5],[15,3,15,4],[14,3,14,4],[5,3,11,5],[17,3,17,4],[12,5,28,5],[22,3,22,4],[23,3,23,4],[12,3,12,4],[13,3,13,4]]}
[]
[null,"4. End Use Categories"]
[null,"An End Use is a functional category of water use within your premises. A number of End Uses are pre defined.\nHowever, this sheet can be used to define other significant end uses at your premises.  You can only define an End Use once. If a cell goes red, it means that there is a blank cell above it, or the cell's value is a duplicate in the list.  Cells in column C must be consecutive, with no blank cells in between defined end uses, as this will affect the rest of the tool's operation."]
[]
[null,"End use category title",null,null,"Details"]
[null,1,"Toilets","Standard end use definitions - All fixed"]
{"$rows_left_out":24}
{"sheet":"5-1A Taps & Showers","index":10,"n_rows":736,"n_cols":20,"rows_kept":736,"cut":false,"hidden":false,"merged":[[9,17,11,17],[9,19,11,19],[3,19,5,19],[9,18,11,18],[3,18,5,18],[3,17,5,17],[3,15,7,15],[3,12,7,14],[3,9,7,9],[9,9,11,9],[3,10,5,10],[8,15,8,16],[9,15,11,15],[3,16,5,16],[9,16,11,16],[9,14,11,14],[3,11,7,11],[9,13,11,13],[9,12,11,12],[9,5,11,5],[3,5,7,5],[9,7,11,7],[9,10,11,10],[2,2,2,10],[2,11,2,16],[1,2,1,19],[1,1,2,1],[2,17,2,19],[9,2,11,2],[9,3,11,3],[3,1,7,1],[3,2,7,3],[8,2,8,11],[3,4,7,4],[9,8,11,8],[3,7,7,7],[9,6,11,6],[9,4,11,4],[3,8,7,8],[3,6,7,6]]}
[]
[null,"5-1A - Taps & Showers"]
[null,null,"Current Fixture Information",null,null,null,null,null,null,null,null,"Proposed Actions",null,null,null,null,null,"Results"]
[null,"Location","Fixture type count  - number of like fixtures ",null,"Average duration of use","Average number of users per day","Average usage per person","Number of days used","Current usage rate","% of use which is volumetric i.e. fixed","General condition","Does the fixture require changes to improve water efficiency?","Action",null,null,"Completion date","New usage rate","Current usage\n(ML per year)","Water saving\n(ML per year)","Water saving\n(%)"]
[]
[]
{"$rows_left_out":731}
{"sheet":"5-1B Toilets & Urinals","index":11,"n_rows":739,"n_cols":33,"rows_kept":739,"cut":false,"hidden":false,"merged":[[8,5,8,6],[3,5,7,9],[8,7,8,9],[3,19,4,23],[5,20,5,23],[6,20,6,23],[7,20,7,23],[8,21,8,23],[9,26,11,26],[3,26,4,26],[3,15,7,17],[3,25,4,25],[9,25,11,25],[3,24,4,24],[8,19,8,20],[9,24,11,24],[9,23,11,23],[9,18,11,18],[9,16,11,16],[9,17,11,17],[9,22,11,22],[9,20,11,20],[9,21,11,21],[3,1,7,1],[3,2,7,4],[3,12,7,12],[3,11,7,11],[3,10,7,10],[9,7,11,7],[9,10,11,10],[9,9,11,9],[9,8,11,8],[9,15,11,15],[9,2,11,2],[1,2,1,26],[1,1,2,1],[2,2,2,14],[3,14,7,14],[3,18,7,18],[9,12,11,12],[9,19,11,19],[3,13,5,13],[9,13,11,13],[2,24,2,26],[9,3,11,3],[9,4,11,4],[9,5,11,5],[9,6,11,6],[9,11,11,11]]}
[]
[null,"5-1B - Toilets & Urinals"]
[null,null,"Current Fixture Information",null,null,null,null,null,null,null,null,null,null,null,null,"Proposed Actions",null,null,null,null,null,null,null,null,"Results",null,null,null,null,null,null,"Urinals"]
[null,"Location","Fixture type count - number of like fixtures ",null,null,"Current use",null,null,null,null,"Average number of users per day","Average usage per person","Number of days used","General condition","Does the fixture require changes to improve water efficiency?","Action",null,null,"Completion date","New use",null,null,null,null,"Current water use\n(ML per year)","Water savings\n(ML per year)","Water savings\n(%)",null,null,null,null,{"$f":"I10","v":"Equipment type"},{"$f":"J10","v":"Operation type"}]
[null,null,null,null,null,null,null,null,null,null,null,null,null,null,null,null,null,null,null,null,null,null,null,null,null,null,null,null,null,null,null,"Urinal suite (cistern)","Conscious operation"]
[null,null,null,null,null,null,null,null,null,null,null,null,null,null,null,null,null,null,null,null,"Toilet",null,null,null,{"$f":"SUMIF($C$15:$C$739,\">0\",$Y$15:$Y$739)","v":0},{"$f":"SUMIF($C$15:$C$739,\">0\",$Z$15:$Z$739)","v":0},{"$f":"Z6/Y6","v":{"$error":"#DIV/0!"}},null,null,null,null,"Urinal suite (flushing valve)","Demand driven - operation sensitivity at front of the urinal"]
{"$rows_left_out":734}
{"sheet":"Quarterly Lookup","index":12,"n_rows":13,"n_cols":2,"rows_kept":13,"cut":false,"hidden":true,"merged":[]}
["Month","Quarter Index"]
[1,3]
[2,3]
[3,3]
[4,4]
[5,4]
{"$rows_left_out":8}
{"sheet":"5-2 Cooling Tower","index":13,"n_rows":27,"n_cols":18,"rows_kept":27,"cut":false,"hidden":false,"merged":[[5,1,5,2],[2,13,26,13],[4,1,4,2],[3,5,3,6],[3,16,3,17],[1,1,1,17],[3,1,3,2],[3,11,3,12],[2,14,2,17],[2,1,2,2],[2,3,2,12]]}
[]
[null,"5-2 Cooling Towers"]
[null,null,null,"Current water use",null,null,null,null,null,null,null,null,null,null,"Proposed water efficiency"]
[null,"Cooling tower name(s) or ID number(s)",null,"Conductivity of make-up water","Conductivity of bleed","Current cycles of concentration",null,"Total bleed","Total consumption","Average daily consumption","Leakage ","Leakage\n(%)",null,null,"Water saving","Percentage saved","Proposed cycles of concentration"]
[null,"Units",null,"μS or mg/L","μS or mg/L","CoCi","OK >5?","ML/year","ML/year","kL/day","ML/year","%","Acceptable",null,"ML/yr","%","CoCf","OK >5?"]
[null,"Total or average",null,{"$f":"AVERAGE(D8:D27)","v":{"$error":"#DIV/0!"}},{"$f":"AVERAGE(E8:E27)","v":{"$error":"#DIV/0!"}},{"$f":"AVERAGE(F8:F27)","v":{"$error":"#DIV/0!"}},{"$f":"COUNTIF(G8:G27,\"Efficient\")","v":0},{"$f":"SUMIF(H8:H27,\">0\")","v":0},{"$f":"SUMIF(I8:I27,\">0\")","v":0},{"$f":"SUMIF(J8:J27,\">0\")","v":0},{"$f":"SUMIF(K8:K27,\">0\")","v":0},{"$f":"SUMIF(L8:L27,\">0\")/COUNTIF(L8:L50,\">0\")","v":{"$error":"#DIV/0!"}},{"$f":"COUNTIF(M8:M27,\"Efficient\")","v":0},null,{"$f":"SUMIF(O8:O27,\">0\")","v":0},{"$f":"SUMIF(P8:P27,\">0\")/COUNTIF(P8:P50,\">0\")","v":{"$error":"#DIV/0!"}},{"$f":"AVERAGEA(Q8:Q27)","v":{"$error":"#DIV/0!"}},{"$f":"COUNTIF(R8:R27,\"Efficient\")","v":0}]
{"$rows_left_out":22}
{"sheet":"6 End Use Inventory","index":14,"n_rows":500,"n_cols":11,"rows_kept":500,"cut":false,"hidden":false,"merged":[[1,1,2,10],[6,4,8,4],[16,2,16,10],[11,2,15,2],[7,6,8,6],[7,7,9,7],[7,8,9,8],[7,10,9,10],[7,9,9,9]]}
[]
[null,"6. End Use Inventory - Current water use breakdown"]
[]
[null,null,"Baseline year",{"$f":"'1 Water Use Summary'!C4","v":0}]
[null,null,"Baseline consumption (ML/year)",{"$f":"'1 Water Use Summary'!C5","v":0}]
[null,null," End use model consumption (ML/year)",{"$f":"G10","v":0}]
{"$rows_left_out":495}
{"sheet":"7 End Use Totals","index":15,"n_rows":31,"n_cols":12,"rows_kept":31,"cut":false,"hidden":false,"merged":[[3,2,4,2],[2,2,2,4],[31,1,31,7]]}
[]
[]
[null,null,"7. End Use Totals - Breakdown"]
[null,null,"Press this button to see all possible end uses:"]
[null,null,null,"#","End Use","End use total\n(ML/year)","Percentage of total (%)","Proposed end use saving (%)"]
[null,null,null,null,"Total",{"$f":"'6 End Use Inventory'!D5","v":0},null,{"$f":"IF(COUNTIF(H7:H31,\">1\")>0,\"Check savings!\",)","v":0},"EndUse","Imp"]
{"$rows_left_out":26}
{"sheet":"9-1 Water Saving Measures","index":17,"n_rows":91,"n_cols":14,"rows_kept":91,"cut":false,"hidden":false,"merged":[[1,1,2,4],[59,1,59,13],[6,13,7,13],[6,6,6,12],[6,2,7,2],[6,4,7,4],[6,3,7,3],[3,1,4,4]]}
[]
[null,"9-1 Water Saving Measures"]
[]
[null,"Use the WEMP Water Saving Measures checklist to assist you in developing water saving ideas"]
[]
[]
{"$rows_left_out":86}
{"sheet":"9-2 Economic Assessment","index":18,"n_rows":59,"n_cols":17,"rows_kept":59,"cut":false,"hidden":false,"merged":[[3,2,3,3],[1,6,1,9],[5,2,5,3],[4,2,4,3],[3,5,6,16],[1,2,1,4]]}
[]
[null,null,"9-2 Economic Assessment"]
[]
[null,null,"Variable water cost per kL saved ($/kL) "]
[null,null,"Variable trade waste cost per kL saved ($/kL)"]
[null,null,"Total water cost per kL saved ($/kL)",null,{"$f":"SUM(E4:E5)","v":0}]
{"$rows_left_out":54}
{"sheet":"9-3 Action Plan","index":19,"n_rows":60,"n_cols":18,"rows_kept":60,"cut":false,"hidden":false,"merged":[[5,2,5,3],[4,2,4,4],[8,2,8,8],[1,1,60,1],[8,13,8,17],[1,8,6,18],[7,18,60,18],[1,2,1,5],[6,2,6,7],[1,6,5,7],[2,2,2,4],[3,2,3,4]]}
[]
[null,null,"9-3 Water Saving Measures Action Plan "]
[null,null,"Current total water use (ML/year)",null,null,{"$f":"'1 Water Use Summary'!C5","v":0}]
[null,null,"Proposed water savings (ML/year)",null,null,{"$f":"SUMIF($D11:$D60,\"Yes\",G11:G60)","v":0}]
[null,null,"Percentage reduction (%)",null,null,{"$f":"F4/F3","v":{"$error":"#DIV/0!"}}]
[null,null,"Target",null,{"$f":"'1 Water Use Summary'!F10","v":"KPI (L/ )"},{"$f":"'1 Water Use Summary'!C7*(100%-F5)","v":{"$error":"#DIV/0!"}}]
{"$rows_left_out":55}
{"sheet":"Data","index":20,"n_rows":20,"n_cols":6,"rows_kept":20,"cut":false,"hidden":true,"merged":[]}
["End Uses",null,"Discount Rate","Cost of Energy($/kWh)","Cost per degree change per Litre ($)","Incoming water Temperature (degrees C)"]
["Toilets",null,0.08,2.56,1.4337021111111113E-4,20]
["Taps"]
["Showers"]
["Urinals - individual"]
["Urinals - trough"]
{"$rows_left_out":14}